Reaction Details
TargetMatrix metalloproteinase-16
LigandBDBM50137286
Substrate/Competitorn/a
Meas. Tech.ChEBML_106799
IC50 1677±n/a nM
Citation Ma, DWu, WYang, GLi, JLi, JYe, Q Tetrahydroisoquinoline based sulfonamide hydroxamates as potent matrix metalloproteinase inhibitors. Bioorg Med Chem Lett14:47-50 (2003) Matrix metalloproteinase-16
Name:Matrix metalloproteinase-16
Type:PROTEIN
Mol. Mass.:69536.76
Organism:Homo sapiens (Human)
Description:ChEMBL_799129
Residue:607
BDBM50137286
NameBDBM50137286
Synonyms:6-Hydroxy-2-(4-methoxy-benzenesulfonyl)-1,2,3,4-tetrahydro-isoquinoline-1-carboxylic acid hydroxyamide | CHEMBL356124
TypeSmall organic molecule
Emp. Form.C17H18N2O6S
Mol. Mass.378.4
SMILESCOc1ccc(cc1)S(=O)(=O)N1CCc2cc(O)ccc2C1C(=O)NO