Reaction Details
TargetMacrophage metalloelastase
LigandBDBM50137283
Substrate/Competitorn/a
Meas. Tech.ChEBML_106462
IC50 57.0±n/a nM
Citation Ma, DWu, WYang, GLi, JLi, JYe, Q Tetrahydroisoquinoline based sulfonamide hydroxamates as potent matrix metalloproteinase inhibitors. Bioorg Med Chem Lett14:47-50 (2003) Macrophage metalloelastase
Name:Macrophage metalloelastase
Type:Enzyme
Mol. Mass.:54012.99
Organism:Homo sapiens (Human)
Description:P39900
Residue:470
BDBM50137283
NameBDBM50137283
Synonyms:6-(benzyloxy)-N-hydroxy-2-(4-methoxyphenylsulfonyl)-1,2,3,4-tetrahydroisoquinoline-1-carboxamide CHEMBL358539
TypeSmall organic molecule
Emp. Form.C24H24N2O6S
Mol. Mass.468.522
SMILESCOc1ccc(cc1)S(=O)(=O)N1CCc2cc(OCc3ccccc3)ccc2C1C(=O)NO