Reaction Details
TargetMatrix metalloproteinase-26
LigandBDBM50137283
Substrate/Competitorn/a
Meas. Tech.ChEBML_104566
IC50 744±n/a nM
Citation Ma, DWu, WYang, GLi, JLi, JYe, Q Tetrahydroisoquinoline based sulfonamide hydroxamates as potent matrix metalloproteinase inhibitors. Bioorg Med Chem Lett14:47-50 (2003) Matrix metalloproteinase-26
Name:Matrix metalloproteinase-26
Type:PROTEIN
Mol. Mass.:29707.55
Organism:Homo sapiens (Human)
Description:ChEMBL_806653
Residue:261
BDBM50137283
NameBDBM50137283
Synonyms:6-(benzyloxy)-N-hydroxy-2-(4-methoxyphenylsulfonyl)-1,2,3,4-tetrahydroisoquinoline-1-carboxamide CHEMBL358539
TypeSmall organic molecule
Emp. Form.C24H24N2O6S
Mol. Mass.468.522
SMILESCOc1ccc(cc1)S(=O)(=O)N1CCc2cc(OCc3ccccc3)ccc2C1C(=O)NO