Reaction Details
TargetMethionine aminopeptidase 1
LigandBDBM50137352
Substrate/Competitorn/a
Meas. Tech.ChEBML_105139
Ki 33000±n/a nM
Citation Hu, XZhu, JSrivathsan, SPei, D Peptidyl hydroxamic acids as methionine aminopeptidase inhibitors. Bioorg Med Chem Lett14:77-9 (2003) Methionine aminopeptidase 1
Name:Methionine aminopeptidase 1
Type:Enzyme
Mol. Mass.:43220.79
Organism:Homo sapiens (Human)
Description:MetAP1 with an N-terminal six histidine tag was expressed in baculovirus infected sf9 cells.
Residue:386
BDBM50137352
NameBDBM50137352
Synonyms:(S)-2-Amino-hexanoic acid hydroxy-[(2-pyridin-2-yl-ethylcarbamoyl)-methyl]-amide | CHEMBL167633
TypeSmall organic molecule
Emp. Form.C15H24N4O3
Mol. Mass.308.3761
SMILESCCCC[C@H](N)C(=O)N(O)CC(=O)NCCc1ccccn1