Reaction Details
TargetMethionine aminopeptidase 2
LigandBDBM50137352
Substrate/Competitorn/a
Meas. Tech.ChEBML_105144
Ki 164000±n/a nM
Citation Hu, XZhu, JSrivathsan, SPei, D Peptidyl hydroxamic acids as methionine aminopeptidase inhibitors. Bioorg Med Chem Lett14:77-9 (2003) Methionine aminopeptidase 2
Name:Methionine aminopeptidase 2
Type:Enzyme
Mol. Mass.:52884.45
Organism:Homo sapiens (Human)
Description:P50579
Residue:478
BDBM50137352
NameBDBM50137352
Synonyms:(S)-2-Amino-hexanoic acid hydroxy-[(2-pyridin-2-yl-ethylcarbamoyl)-methyl]-amide | CHEMBL167633
TypeSmall organic molecule
Emp. Form.C15H24N4O3
Mol. Mass.308.3761
SMILESCCCC[C@H](N)C(=O)N(O)CC(=O)NCCc1ccccn1