Reaction Details
TargetMethionine aminopeptidase 2
LigandBDBM50137354
Substrate/Competitorn/a
Meas. Tech.ChEBML_105144
Ki 600000±n/a nM
Citation Hu, XZhu, JSrivathsan, SPei, D Peptidyl hydroxamic acids as methionine aminopeptidase inhibitors. Bioorg Med Chem Lett14:77-9 (2003) Methionine aminopeptidase 2
Name:Methionine aminopeptidase 2
Type:Enzyme
Mol. Mass.:52884.45
Organism:Homo sapiens (Human)
Description:P50579
Residue:478
BDBM50137354
NameBDBM50137354
Synonyms:CHEMBL164406 | [((R)-2-Amino-propionyl)-hydroxy-amino]-acetic acid
TypeSmall organic molecule
Emp. Form.C5H10N2O4
Mol. Mass.162.1439
SMILESC[C@@H](N)C(=O)N(O)CC(O)=O