Reaction Details
TargetMethionine aminopeptidase 1
LigandBDBM50137355
Substrate/Competitorn/a
Meas. Tech.ChEBML_105139
Ki 48000±n/a nM
Citation Hu, XZhu, JSrivathsan, SPei, D Peptidyl hydroxamic acids as methionine aminopeptidase inhibitors. Bioorg Med Chem Lett14:77-9 (2003) Methionine aminopeptidase 1
Name:Methionine aminopeptidase 1
Type:Enzyme
Mol. Mass.:43220.79
Organism:Homo sapiens (Human)
Description:MetAP1 with an N-terminal six histidine tag was expressed in baculovirus infected sf9 cells.
Residue:386
BDBM50137355
NameBDBM50137355
Synonyms:(S)-2-Amino-N-hydroxy-4-methylsulfanyl-N-[(2-pyridin-2-yl-ethylcarbamoyl)-methyl]-butyramide | CHEMBL164506
TypeSmall organic molecule
Emp. Form.C14H22N4O3S
Mol. Mass.326.414
SMILESCSCC[C@H](N)C(=O)N(O)CC(=O)NCCc1ccccn1