Reaction Details
TargetMethionine aminopeptidase 2
LigandBDBM50137353
Substrate/Competitorn/a
Meas. Tech.ChEBML_105144
Ki 1300000±n/a nM
Citation Hu, XZhu, JSrivathsan, SPei, D Peptidyl hydroxamic acids as methionine aminopeptidase inhibitors. Bioorg Med Chem Lett14:77-9 (2003) Methionine aminopeptidase 2
Name:Methionine aminopeptidase 2
Type:Enzyme
Mol. Mass.:52884.45
Organism:Homo sapiens (Human)
Description:P50579
Residue:478
BDBM50137353
NameBDBM50137353
Synonyms:CHEMBL349154 | [((S)-2-Amino-4-methylsulfanyl-butyryl)-hydroxy-amino]-acetic acid
TypeSmall organic molecule
Emp. Form.C7H14N2O4S
Mol. Mass.222.262
SMILESCSCC[C@H](N)C(=O)N(O)CC(O)=O