Reaction Details
TargetProcathepsin L
LigandBDBM50137398
Substrate/Competitorn/a
Meas. Tech.ChEBML_48367
Ki 1±n/a nM
Citation Kim, TSHague, ABLee, TILian, BTegley, CMWang, XBurgess, TLQian, YXRoss, STagari, PLin, CHMayeda, CDao, JJordan, SMohr, CCheetham, JViswanadhan, VTasker, AS (4-Piperidinylphenyl)aminoethyl amides as a novel class of non-covalent cathepsin K inhibitors. Bioorg Med Chem Lett14:87-90 (2003) Procathepsin L
Name:Procathepsin L
Type:Enzyme
Mol. Mass.:37557.19
Organism:Homo sapiens (Human)
Description:Purchased from Calbiochem (San Diego, CA).
Residue:333
BDBM50137398
NameBDBM50137398
Synonyms:((R)-2-(4-Hydroxy-phenyl)-1-{3-phenyl-1-[(4-piperidin-1-yl-phenylamino)-methyl]-propylcarbamoyl}-ethyl)-carbamic acid benzyl ester | CHEMBL169560
TypeSmall organic molecule
Emp. Form.C38H44N4O4
Mol. Mass.620.7804
SMILESOc1ccc(C[C@@H](NC(=O)OCc2ccccc2)C(=O)N[C@@H](CCc2ccccc2)CNc2ccc(cc2)N2CCCCC2)cc1