Reaction Details
TargetProcathepsin L
LigandBDBM50137400
Substrate/Competitorn/a
Meas. Tech.ChEBML_48367
Ki 1±n/a nM
Citation Kim, TSHague, ABLee, TILian, BTegley, CMWang, XBurgess, TLQian, YXRoss, STagari, PLin, CHMayeda, CDao, JJordan, SMohr, CCheetham, JViswanadhan, VTasker, AS (4-Piperidinylphenyl)aminoethyl amides as a novel class of non-covalent cathepsin K inhibitors. Bioorg Med Chem Lett14:87-90 (2003) Procathepsin L
Name:Procathepsin L
Type:Enzyme
Mol. Mass.:37557.19
Organism:Homo sapiens (Human)
Description:Purchased from Calbiochem (San Diego, CA).
Residue:333
BDBM50137400
NameBDBM50137400
Synonyms:((R)-2-Phenyl-1-{3-phenyl-1-[(4-piperidin-1-yl-phenylamino)-methyl]-propylcarbamoyl}-ethyl)-carbamic acid benzyl ester | CHEMBL169448
TypeSmall organic molecule
Emp. Form.C38H44N4O3
Mol. Mass.604.781
SMILESO=C(N[C@H](Cc1ccccc1)C(=O)N[C@@H](CCc1ccccc1)CNc1ccc(cc1)N1CCCCC1)OCc1ccccc1