Reaction Details
TargetAldehyde dehydrogenase family 1 member A3
LigandBDBM50572095
Substrate/Competitorn/a
Meas. Tech.ChEMBL_2116258 (CHEMBL4825199)
IC50 590±n/a nM
Citation Ma, ZJiang, LLi, BLiang, DFeng, YLiu, LJiang, C Discovery of benzimidazole derivatives as potent and selective aldehyde dehydrogenase 1A1 (ALDH1A1) inhibitors with glucose consumption improving activity. Bioorg Med Chem46:0 (2021) 
 
Aldehyde dehydrogenase family 1 member A3
Name:Aldehyde dehydrogenase family 1 member A3
Type:PROTEIN
Mol. Mass.:56110.85
Organism:Homo sapiens (Human)
Description:ChEMBL_109700
Residue:512
BDBM50572095
NameBDBM50572095
Synonyms:CHEMBL4862473
TypeSmall organic molecule
Emp. Form.C24H25F3N4O
Mol. Mass.442.4767
SMILESFC(F)(F)c1cccc(Cn2c(CN3CCN(CC3)C(=O)C3CC3)nc3ccccc23)c1