Reaction Details
TargetD(3) dopamine receptor
LigandBDBM50104122
Substrate/Competitorn/a
Meas. Tech.ChEBML_62750
Ki 1.4±n/a nM
Citation Mach, RHHuang, YFreeman, RAWu, LVangveravong, SLuedtke, RR Conformationally-flexible benzamide analogues as dopamine D3 and sigma 2 receptor ligands. Bioorg Med Chem Lett14:195-202 (2003) D(3) dopamine receptor
Name:D(3) dopamine receptor
Type:Protein
Mol. Mass.:49540.58
Organism:Rattus norvegicus (Rat)
Description:P19020
Residue:446
BDBM50104122
NameBDBM50104122
Synonyms:9-Oxo-9H-fluorene-4-carboxylic acid {4-[4-(2,3-dichloro-phenyl)-piperazin-1-yl]-butyl}-amide | CHEMBL301242
TypeSmall organic molecule
Emp. Form.C28H27Cl2N3O2
Mol. Mass.508.439
SMILESClc1cccc(N2CCN(CCCCNC(=O)c3cccc4C(=O)c5ccccc5-c34)CC2)c1Cl