Reaction Details
TargetSigma non-opioid intracellular receptor 1
LigandBDBM50137624
Substrate/Competitorn/a
Meas. Tech.ChEBML_201426
Ki 5484.0±n/a nM
Citation Mach, RHHuang, YFreeman, RAWu, LVangveravong, SLuedtke, RR Conformationally-flexible benzamide analogues as dopamine D3 and sigma 2 receptor ligands. Bioorg Med Chem Lett14:195-202 (2003) Sigma non-opioid intracellular receptor 1
Name:Sigma non-opioid intracellular receptor 1
Type:Enzyme Catalytic Domain
Mol. Mass.:25124.85
Organism:Homo sapiens (Human)
Description:Q99720
Residue:223
BDBM50137624
NameBDBM50137624
Synonyms:5-Bromo-N-[2-(6,7-dimethoxy-3,4-dihydro-1H-isoquinolin-2-yl)-ethyl]-2-methoxy-benzamide | CHEMBL64261
TypeSmall organic molecule
Emp. Form.C21H25BrN2O4
Mol. Mass.449.338
SMILESCOc1cc2CCN(CCNC(=O)c3cc(Br)ccc3OC)Cc2cc1OC