Reaction Details
TargetReplication protein E1
LigandBDBM50137887
Substrate/Competitorn/a
Meas. Tech.ChEBML_84985
IC50>80000±n/a nM
Citation Faucher, AMWhite, PWBrochu, CGrand-Maître, CRancourt, JFazal, G Discovery of small-molecule inhibitors of the ATPase activity of human papillomavirus E1 helicase. J Med Chem47:18-21 (2003) 
 
Replication protein E1
Name:Replication protein E1
Type:PROTEIN
Mol. Mass.:73515.58
Organism:Human papillomavirus type 11
Description:ChEMBL_84985
Residue:649
BDBM50137887
NameBDBM50137887
Synonyms:4'-Methanesulfonyl-biphenyl-3-carboxylic acid (naphthalen-1-ylmethyl)-amide | CHEMBL174582
TypeSmall organic molecule
Emp. Form.C25H21NO3S
Mol. Mass.415.504
SMILESCS(=O)(=O)c1ccc(cc1)-c1cccc(c1)C(=O)NCc1cccc2ccccc12