Reaction Details
TargetReplication protein E1
LigandBDBM50137903
Substrate/Competitorn/a
Meas. Tech.ChEBML_84985
IC50>80000±n/a nM
Citation Faucher, AMWhite, PWBrochu, CGrand-Maître, CRancourt, JFazal, G Discovery of small-molecule inhibitors of the ATPase activity of human papillomavirus E1 helicase. J Med Chem47:18-21 (2003) 
 
Replication protein E1
Name:Replication protein E1
Type:PROTEIN
Mol. Mass.:73515.58
Organism:Human papillomavirus type 11
Description:ChEMBL_84985
Residue:649
BDBM50137903
NameBDBM50137903
Synonyms:2-(Biphenyl-4-sulfonyl)-acetamide CHEMBL427490
TypeSmall organic molecule
Emp. Form.C14H13NO3S
Mol. Mass.275.323
SMILESNC(=O)CS(=O)(=O)c1ccc(cc1)-c1ccccc1