Reaction Details
TargetReplication protein E1
LigandBDBM50137906
Substrate/Competitorn/a
Meas. Tech.ChEBML_84985
IC50 72000±n/a nM
Citation Faucher, AMWhite, PWBrochu, CGrand-Maître, CRancourt, JFazal, G Discovery of small-molecule inhibitors of the ATPase activity of human papillomavirus E1 helicase. J Med Chem47:18-21 (2003) 
 
Replication protein E1
Name:Replication protein E1
Type:PROTEIN
Mol. Mass.:73515.58
Organism:Human papillomavirus type 11
Description:ChEMBL_84985
Residue:649
BDBM50137906
NameBDBM50137906
Synonyms:3-(Biphenyl-4-sulfonyl)-propionic acid | CHEMBL175575
TypeSmall organic molecule
Emp. Form.C15H14O4S
Mol. Mass.290.334
SMILESOC(=O)CCS(=O)(=O)c1ccc(cc1)-c1ccccc1