Reaction Details
TargetReplication protein E1
LigandBDBM50137909
Substrate/Competitorn/a
Meas. Tech.ChEBML_84985
IC50 1900±n/a nM
Citation Faucher, AMWhite, PWBrochu, CGrand-Maître, CRancourt, JFazal, G Discovery of small-molecule inhibitors of the ATPase activity of human papillomavirus E1 helicase. J Med Chem47:18-21 (2003) 
 
Replication protein E1
Name:Replication protein E1
Type:PROTEIN
Mol. Mass.:73515.58
Organism:Human papillomavirus type 11
Description:ChEMBL_84985
Residue:649
BDBM50137909
NameBDBM50137909
Synonyms:CHEMBL439656 | {4'-[(2-Acetylamino-ethylcarbamoyl)-methyl]-biphenyl-4-sulfonyl}-acetic acid
TypeSmall organic molecule
Emp. Form.C20H22N2O6S
Mol. Mass.418.463
SMILESCC(=O)NCCNC(=O)Cc1ccc(cc1)-c1ccc(cc1)S(=O)(=O)CC(O)=O