Reaction Details
TargetReplication protein E1
LigandBDBM50137907
Substrate/Competitorn/a
Meas. Tech.ChEBML_84985
IC50>80000±n/a nM
Citation Faucher, AMWhite, PWBrochu, CGrand-Maître, CRancourt, JFazal, G Discovery of small-molecule inhibitors of the ATPase activity of human papillomavirus E1 helicase. J Med Chem47:18-21 (2003) 
 
Replication protein E1
Name:Replication protein E1
Type:PROTEIN
Mol. Mass.:73515.58
Organism:Human papillomavirus type 11
Description:ChEMBL_84985
Residue:649
BDBM50137907
NameBDBM50137907
Synonyms:(4-Phenylsulfanyl-benzenesulfonyl)-acetic acid | CHEMBL177222
TypeSmall organic molecule
Emp. Form.C14H12O4S2
Mol. Mass.308.373
SMILESOC(=O)CS(=O)(=O)c1ccc(Sc2ccccc2)cc1