Reaction Details
TargetReplication protein E1
LigandBDBM50137924
Substrate/Competitorn/a
Meas. Tech.ChEBML_84985
IC50 420±n/a nM
Citation Faucher, AMWhite, PWBrochu, CGrand-Maître, CRancourt, JFazal, G Discovery of small-molecule inhibitors of the ATPase activity of human papillomavirus E1 helicase. J Med Chem47:18-21 (2003) 
 
Replication protein E1
Name:Replication protein E1
Type:PROTEIN
Mol. Mass.:73515.58
Organism:Human papillomavirus type 11
Description:ChEMBL_84985
Residue:649
BDBM50137924
NameBDBM50137924
Synonyms:(3'-Phenylcarbamoyl-biphenyl-4-sulfonyl)-acetic acid | CHEMBL174332
TypeSmall organic molecule
Emp. Form.C21H17NO5S
Mol. Mass.395.428
SMILESOC(=O)CS(=O)(=O)c1ccc(cc1)-c1cccc(c1)C(=O)Nc1ccccc1