Reaction Details
TargetReplication protein E1
LigandBDBM50137919
Substrate/Competitorn/a
Meas. Tech.ChEBML_84985
IC50 20±n/a nM
Citation Faucher, AMWhite, PWBrochu, CGrand-Maître, CRancourt, JFazal, G Discovery of small-molecule inhibitors of the ATPase activity of human papillomavirus E1 helicase. J Med Chem47:18-21 (2003) 
 
Replication protein E1
Name:Replication protein E1
Type:PROTEIN
Mol. Mass.:73515.58
Organism:Human papillomavirus type 11
Description:ChEMBL_84985
Residue:649
BDBM50137919
NameBDBM50137919
Synonyms:CHEMBL174279 | [3'-((S)-Indan-1-ylcarbamoylmethyl)-biphenyl-4-sulfonyl]-acetic acid
TypeSmall organic molecule
Emp. Form.C25H23NO5S
Mol. Mass.449.519
SMILESOC(=O)CS(=O)(=O)c1ccc(cc1)-c1cccc(CC(=O)N[C@H]2CCc3ccccc23)c1