Reaction Details
TargetReplication protein E1
LigandBDBM50137926
Substrate/Competitorn/a
Meas. Tech.ChEBML_84985
IC50 65000±n/a nM
Citation Faucher, AMWhite, PWBrochu, CGrand-Maître, CRancourt, JFazal, G Discovery of small-molecule inhibitors of the ATPase activity of human papillomavirus E1 helicase. J Med Chem47:18-21 (2003) 
 
Replication protein E1
Name:Replication protein E1
Type:PROTEIN
Mol. Mass.:73515.58
Organism:Human papillomavirus type 11
Description:ChEMBL_84985
Residue:649
BDBM50137926
NameBDBM50137926
Synonyms:(Biphenyl-4-sulfonyl)-methanesulfonic acid CHEMBL177619
TypeSmall organic molecule
Emp. Form.C13H11NO4S
Mol. Mass.277.296
SMILES[O-][N+](=O)CS(=O)(=O)c1ccc(cc1)-c1ccccc1