Reaction Details
TargetVasopressin V1a/V1b receptor
LigandBDBM50137951
Substrate/Competitorn/a
Meas. Tech.ChEMBL_214265 (CHEMBL821106)
IC50 20±n/a nM
Citation Cho, HMurakami, KNakanishi, HFujisawa, AIsoshima, HNiwa, MHayakawa, KHase, YUchida, IWatanabe, HWakitani, KAisaka, K Synthesis and structure-activity relationships of 5,6,7,8-tetrahydro-4H-thieno[3,2-b]azepine derivatives: novel arginine vasopressin antagonists. J Med Chem47:101-9 (2003) 
 
Vasopressin V1a/V1b receptor
Name:Vasopressin V1a/V1b receptor
Synonyms:Vasopressin V1 receptor
Type:n/a
Mol. Mass.:n/a
Description:ASSAY_ID of ChEMBL is 214265
Components:This complex has 2 components.
Component 1
Name:Vasopressin V1a receptor
Type:Enzyme Catalytic Domain
Mol. Mass.:47674.81
Organism:RAT
Description:VASOPRESSIN V1A AVPR1A RAT::P30560
Residue:424
Component 2
Name:Vasopressin V1b receptor
Synonyms:Avpr1b VASOPRESSIN V1B Vasopressin receptor
Type:Enzyme Catalytic Domain
Mol. Mass.:47104.48
Organism:RAT
Description:VASOPRESSIN V1B AVPR1B RAT::P48974
Residue:425
BDBM50137951
NameBDBM50137951
Synonyms:Biphenyl-2-carboxylic acid [2-{4-[(2-dimethylamino-ethyl)-methyl-amino]-butoxy}-4-(5,6,7,8-tetrahydro-thieno[3,2-b]azepine-4-carbonyl)-phenyl]-amide | CHEMBL177248
TypeSmall organic molecule
Emp. Form.C37H44N4O3S
Mol. Mass.624.835
SMILESCN(C)CCN(C)CCCCOc1cc(ccc1NC(=O)c1ccccc1-c1ccccc1)C(=O)N1CCCCc2sccc12