Reaction Details
TargetVasopressin V1a/V1b receptor
LigandBDBM50137940
Substrate/Competitorn/a
Meas. Tech.ChEMBL_214262 (CHEMBL820469)
IC50 3±n/a nM
Citation Cho, HMurakami, KNakanishi, HFujisawa, AIsoshima, HNiwa, MHayakawa, KHase, YUchida, IWatanabe, HWakitani, KAisaka, K Synthesis and structure-activity relationships of 5,6,7,8-tetrahydro-4H-thieno[3,2-b]azepine derivatives: novel arginine vasopressin antagonists. J Med Chem47:101-9 (2003) 
 
Vasopressin V1a/V1b receptor
Name:Vasopressin V1a/V1b receptor
Synonyms:Vasopressin V1 receptor
Type:n/a
Mol. Mass.:n/a
Description:ASSAY_ID of ChEMBL is 329920
Components:This complex has 2 components.
Component 1
Name:Vasopressin V1a receptor
Type:Receptor
Mol. Mass.:46820.18
Organism:Homo sapiens (Human)
Description:P37288
Residue:418
Component 2
Name:Vasopressin V1b receptor
Synonyms:AVPR V1b AVPR1B Antidiuretic hormone receptor 1b V1bR VPR3 Vasopressin V1b receptor (V1b) Vasopressin V3 receptor
Type:Enzyme
Mol. Mass.:46985.01
Organism:Homo sapiens (Human)
Description:P47901
Residue:424
BDBM50137940
NameBDBM50137940
Synonyms:Biphenyl-2-carboxylic acid [2-[4-(4-dimethylamino-piperidin-1-yl)-4-oxo-butoxy]-4-(5,6,7,8-tetrahydro-thieno[3,2-b]azepine-4-carbonyl)-phenyl]-amide | CHEMBL430083
TypeSmall organic molecule
Emp. Form.C39H44N4O4S
Mol. Mass.664.856
SMILESCN(C)C1CCN(CC1)C(=O)CCCOc1cc(ccc1NC(=O)c1ccccc1-c1ccccc1)C(=O)N1CCCCc2sccc12