Reaction Details
TargetNitric oxide synthase, inducible
LigandBDBM50225106
Substrate/Competitorn/a
Meas. Tech.ChEBML_89345
IC50 80000±n/a nM
Citation Ueda, STerauchi, HYano, AIdo, MMatsumoto, MKawasaki, M 4,5-Disubstituted-1,3-oxazolidin-2-imine derivatives: a new class of orally bioavailable nitric oxide synthase inhibitor. Bioorg Med Chem Lett14:313-6 (2003) Nitric oxide synthase, inducible
Name:Nitric oxide synthase, inducible
Type:Enzyme
Mol. Mass.:130595.79
Organism:Mus musculus (mouse)
Description:Recombinant enzyme overexpressed in E. coli.
Residue:1144
BDBM50225106
NameBDBM50225106
Synonyms:(2S)-2-amino-5-{[(E)-amino(nitroimino)methyl]amino}pentanoic acid (2S)-2-amino-5-{[(E)-imino(nitroamino)methyl]amino}pentanoic acid (S)-2-Amino-5-(N'-nitro-guanidino)-pentanoic acid CHEMBL227744 N-nitro-L-arginine Ngamma-nitro-L-arginine | Nomega-nitro-L-arginine
TypeSmall organic molecule
Emp. Form.C6H13N5O4
Mol. Mass.219.1985
SMILESN[C@@H](CCCNC(N)=N[N+]([O-])=O)C(O)=O