Reaction Details
TargetCytochrome P450 2C19
LigandBDBM50138236
Substrate/Competitorn/a
Meas. Tech.ChEMBL_51522 (CHEMBL660382)
IC50<46±n/a nM
Citation Nakamura, TKakinuma, HUmemiya, HAmada, HMiyata, NTaniguchi, KBando, KSato, M Imidazole derivatives as new potent and selective 20-HETE synthase inhibitors. Bioorg Med Chem Lett14:333-6 (2003) Cytochrome P450 2C19
Name:Cytochrome P450 2C19
Type:Enzyme
Mol. Mass.:55935.47
Organism:Homo sapiens (Human)
Description:P33261
Residue:490
BDBM50138236
NameBDBM50138236
Synonyms:2-Hexyloxy-5-imidazol-1-yl-pyridine | CHEMBL320105
TypeSmall organic molecule
Emp. Form.C14H19N3O
Mol. Mass.245.3202
SMILESCCCCCCOc1ccc(cn1)-n1ccnc1