Reaction Details
TargetCytochrome P450 2C19
LigandBDBM50138233
Substrate/Competitorn/a
Meas. Tech.ChEMBL_51522 (CHEMBL660382)
IC50<46±n/a nM
Citation Nakamura, TKakinuma, HUmemiya, HAmada, HMiyata, NTaniguchi, KBando, KSato, M Imidazole derivatives as new potent and selective 20-HETE synthase inhibitors. Bioorg Med Chem Lett14:333-6 (2003) Cytochrome P450 2C19
Name:Cytochrome P450 2C19
Type:Enzyme
Mol. Mass.:55935.47
Organism:Homo sapiens (Human)
Description:P33261
Residue:490
BDBM50138233
NameBDBM50138233
Synonyms:2-[3-(4-Imidazol-1-yl-phenoxy)-propyl]-pyridine | CHEMBL115876
TypeSmall organic molecule
Emp. Form.C17H17N3O
Mol. Mass.279.3364
SMILESC(COc1ccc(cc1)-n1ccnc1)Cc1ccccn1