Reaction Details
TargetReverse transcriptase/RNaseH
LigandBDBM50138403
Substrate/Competitorn/a
Meas. Tech.ChEBML_80151
Kd 18000±n/a nM
Citation Chong, YChoo, HChu, CK Effects of fluorine substitution of cytosine analogues on the binding affinity to HIV-1 reverse transcriptase. Bioorg Med Chem Lett14:437-40 (2003) Reverse transcriptase/RNaseH
Name:Reverse transcriptase/RNaseH
Type:PROTEIN
Mol. Mass.:65229.15
Organism:Human immunodeficiency virus 1
Description:ChEMBL_1473730
Residue:566
BDBM50138403
NameBDBM50138403
Synonyms:CHEMBL341799 | [(2R,5S)-5-(4-amino-2-oxopyrimidin-1(2H)-yl)-2,5-dihydrofuran-2-yl]methyl tretraydrogen triphosphate
TypeSmall organic molecule
Emp. Form.C9H14N3O12P3
Mol. Mass.449.1416
SMILESNc1ccn([C@H]2O[C@@H](COP(O)(=O)OP(O)(=O)OP(O)(O)=O)C=C2)c(=O)n1