Reaction Details
TargetAdenosine receptor A1
LigandBDBM50138545
Substrate/Competitorn/a
Meas. Tech.ChEBML_29007
Ki 70±n/a nM
Citation Palle, VPVarkhedkar, VIbrahim, PAhmed, HLi, ZGao, ZOzeck, MWu, YZeng, DWu, LLeung, KChu, NZablocki, JA Affinity and intrinsic efficacy (IE) of 5'-carbamoyl adenosine analogues for the A1 adenosine receptor--efforts towards the discovery of a chronic ventricular rate control agent for the treatment of atrial fibrillation (AF). Bioorg Med Chem Lett14:535-9 (2003) Adenosine receptor A1
Name:Adenosine receptor A1
Type:Protein
Mol. Mass.:36704.13
Organism:Rattus norvegicus (rat)
Description:n/a
Residue:326
BDBM50138545
NameBDBM50138545
Synonyms:(3R,4S,5R)-2-(6-Cyclopentylamino-purin-9-yl)-5-methyl-tetrahydro-furan-3,4-diol CHEMBL150197
TypeSmall organic molecule
Emp. Form.C15H21N5O3
Mol. Mass.319.3589
SMILESC[C@H]1OC([C@H](O)[C@@H]1O)n1cnc2c(NC3CCCC3)ncnc12