Reaction Details
TargetTissue-type plasminogen activator
LigandBDBM50138670
Substrate/Competitorn/a
Meas. Tech.ChEMBL_208066 (CHEMBL814417)
Ki 31800±n/a nM
Citation Wendt, MDRockway, TWGeyer, AMcClellan, WWeitzberg, MZhao, XMantei, RNienaber, VLStewart, KKlinghofer, VGiranda, VL Identification of novel binding interactions in the development of potent, selective 2-naphthamidine inhibitors of urokinase. Synthesis, structural analysis, and SAR of N-phenyl amide 6-substitution. J Med Chem47:303-24 (2004) 
 
Tissue-type plasminogen activator
Name:Tissue-type plasminogen activator
Type:Enzyme
Mol. Mass.:62931.08
Organism:Homo sapiens (Human)
Description:n/a
Residue:562
BDBM50138670
NameBDBM50138670
Synonyms:6-Carbamimidoyl-naphthalene-2-carboxylic acid phenylamide 6-carbamimidoyl-N-phenyl-2-naphthamide uPa_7
TypeSmall organic molecule
Emp. Form.C18H15N3O
Mol. Mass.289.3312
SMILESNC(=N)c1ccc2cc(ccc2c1)C(=O)Nc1ccccc1