Reaction Details
TargetUrokinase-type plasminogen activator
LigandBDBM50138673
Substrate/Competitorn/a
Meas. Tech.ChEMBL_213154 (CHEMBL815981)
Ki 6.3±n/a nM
Citation Wendt, MDRockway, TWGeyer, AMcClellan, WWeitzberg, MZhao, XMantei, RNienaber, VLStewart, KKlinghofer, VGiranda, VL Identification of novel binding interactions in the development of potent, selective 2-naphthamidine inhibitors of urokinase. Synthesis, structural analysis, and SAR of N-phenyl amide 6-substitution. J Med Chem47:303-24 (2004) 
 
Urokinase-type plasminogen activator
Name:Urokinase-type plasminogen activator
Type:Enzyme
Mol. Mass.:48528.62
Organism:Homo sapiens (Human)
Description:P00749
Residue:431
BDBM50138673
NameBDBM50138673
Synonyms:6-Carbamimidoyl-naphthalene-2-carboxylic acid (4-ethyl-1,2,3,4-tetrahydro-isoquinolin-6-yl)-amide CHEMBL108447
TypeSmall organic molecule
Emp. Form.C23H24N4O
Mol. Mass.372.4629
SMILESCCC1CNCc2ccc(NC(=O)c3ccc4cc(ccc4c3)C(N)=N)cc12