Reaction Details
TargetTissue-type plasminogen activator
LigandBDBM50138665
Substrate/Competitorn/a
Meas. Tech.ChEMBL_208066 (CHEMBL814417)
Ki 1120±n/a nM
Citation Wendt, MDRockway, TWGeyer, AMcClellan, WWeitzberg, MZhao, XMantei, RNienaber, VLStewart, KKlinghofer, VGiranda, VL Identification of novel binding interactions in the development of potent, selective 2-naphthamidine inhibitors of urokinase. Synthesis, structural analysis, and SAR of N-phenyl amide 6-substitution. J Med Chem47:303-24 (2004) 
 
Tissue-type plasminogen activator
Name:Tissue-type plasminogen activator
Type:Enzyme
Mol. Mass.:62931.08
Organism:Homo sapiens (Human)
Description:n/a
Residue:562
BDBM50138665
NameBDBM50138665
Synonyms:6-Carbamimidoyl-naphthalene-2-carboxylic acid (1-isopropyl-1,2,3,4-tetrahydro-isoquinolin-7-yl)-amide CHEMBL442201
TypeSmall organic molecule
Emp. Form.C24H26N4O
Mol. Mass.386.4894
SMILESCC(C)C1NCCc2ccc(NC(=O)c3ccc4cc(ccc4c3)C(N)=N)cc12