Reaction Details
TargetUrokinase-type plasminogen activator
LigandBDBM50138668
Substrate/Competitorn/a
Meas. Tech.ChEMBL_213154 (CHEMBL815981)
Ki 35.5±n/a nM
Citation Wendt, MDRockway, TWGeyer, AMcClellan, WWeitzberg, MZhao, XMantei, RNienaber, VLStewart, KKlinghofer, VGiranda, VL Identification of novel binding interactions in the development of potent, selective 2-naphthamidine inhibitors of urokinase. Synthesis, structural analysis, and SAR of N-phenyl amide 6-substitution. J Med Chem47:303-24 (2004) 
 
Urokinase-type plasminogen activator
Name:Urokinase-type plasminogen activator
Type:Enzyme
Mol. Mass.:48528.62
Organism:Homo sapiens (Human)
Description:P00749
Residue:431
BDBM50138668
NameBDBM50138668
Synonyms:6-Carbamimidoyl-naphthalene-2-carboxylic acid (1-cyclopentyl-3,4-dihydro-isoquinolin-7-yl)-amide | CHEMBL323387
TypeSmall organic molecule
Emp. Form.C26H26N4O
Mol. Mass.410.5108
SMILESNC(=N)c1ccc2cc(ccc2c1)C(=O)Nc1ccc2CCN=C(C3CCCC3)c2c1