Reaction Details
TargetTissue-type plasminogen activator
LigandBDBM50138657
Substrate/Competitorn/a
Meas. Tech.ChEMBL_208066 (CHEMBL814417)
Ki 83900±n/a nM
Citation Wendt, MDRockway, TWGeyer, AMcClellan, WWeitzberg, MZhao, XMantei, RNienaber, VLStewart, KKlinghofer, VGiranda, VL Identification of novel binding interactions in the development of potent, selective 2-naphthamidine inhibitors of urokinase. Synthesis, structural analysis, and SAR of N-phenyl amide 6-substitution. J Med Chem47:303-24 (2004) 
 
Tissue-type plasminogen activator
Name:Tissue-type plasminogen activator
Type:Enzyme
Mol. Mass.:62931.08
Organism:Homo sapiens (Human)
Description:n/a
Residue:562
BDBM50138657
NameBDBM50138657
Synonyms:6-Carbamimidoyl-naphthalene-2-carboxylic acid (4-ethyl-phenyl)-amide | CHEMBL111660
TypeSmall organic molecule
Emp. Form.C20H19N3O
Mol. Mass.317.3844
SMILESCCc1ccc(NC(=O)c2ccc3cc(ccc3c2)C(N)=N)cc1