Reaction Details
TargetProthrombin
LigandBDBM50138672
Substrate/Competitorn/a
Meas. Tech.ChEMBL_208336 (CHEMBL813568)
Ki 17600±n/a nM
Citation Wendt, MDRockway, TWGeyer, AMcClellan, WWeitzberg, MZhao, XMantei, RNienaber, VLStewart, KKlinghofer, VGiranda, VL Identification of novel binding interactions in the development of potent, selective 2-naphthamidine inhibitors of urokinase. Synthesis, structural analysis, and SAR of N-phenyl amide 6-substitution. J Med Chem47:303-24 (2004) 
 
Prothrombin
Name:Prothrombin
Type:Protein
Mol. Mass.:70029.57
Organism:Homo sapiens (Human)
Description:P00734
Residue:622
BDBM50138672
NameBDBM50138672
Synonyms:CHEMBL109287 | N-(6-Carbamimidoyl-naphthalen-2-yl)-benzamide
TypeSmall organic molecule
Emp. Form.C18H12N2O
Mol. Mass.272.3007
SMILESO=C(Nc1ccc2cc(ccc2c1)C#N)c1ccccc1