Reaction Details
TargetPlasma kallikrein
LigandBDBM50138667
Substrate/Competitorn/a
Meas. Tech.ChEMBL_92235 (CHEMBL703580)
Ki 436.0±n/a nM
Citation Wendt, MDRockway, TWGeyer, AMcClellan, WWeitzberg, MZhao, XMantei, RNienaber, VLStewart, KKlinghofer, VGiranda, VL Identification of novel binding interactions in the development of potent, selective 2-naphthamidine inhibitors of urokinase. Synthesis, structural analysis, and SAR of N-phenyl amide 6-substitution. J Med Chem47:303-24 (2004) 
 
Plasma kallikrein
Name:Plasma kallikrein
Type:Protein
Mol. Mass.:71391.16
Organism:Homo sapiens (Human)
Description:P03952
Residue:638
BDBM50138667
NameBDBM50138667
Synonyms:6-Carbamimidoyl-naphthalene-2-carboxylic acid (1-isopropyl-3,4-dihydro-isoquinolin-7-yl)-amide 6-carbamimidoyl-N-(1-isopropyl-3,4-dihydroisoquinolin-7-yl)-2-naphthamide | CHEMBL109367
TypeSmall organic molecule
Emp. Form.C24H24N4O
Mol. Mass.384.4736
SMILESCC(C)C1=NCCc2ccc(NC(=O)c3ccc4cc(ccc4c3)C(N)=N)cc12