Reaction Details
TargetMatrix metalloproteinase-14
LigandBDBM50138683
Substrate/Competitorn/a
Meas. Tech.ChEMBL_106780 (CHEMBL718387)
Ki 30100±n/a nM
Citation Matziari, MBeau, FCuniasse, PDive, VYiotakis, A Evaluation of P1'-diversified phosphinic peptides leads to the development of highly selective inhibitors of MMP-11. J Med Chem47:325-36 (2004) 
 
Matrix metalloproteinase-14
Name:Matrix metalloproteinase-14
Type:Protein
Mol. Mass.:65900.19
Organism:Homo sapiens (Human)
Description:P50281
Residue:582
BDBM50138683
NameBDBM50138683
Synonyms:(1-Benzyloxycarbonylamino-2-phenyl-ethyl)-{3-(2-bromo-phenylsulfanyl)-2-[1-carbamoyl-2-(1H-indol-3-yl)-ethylcarbamoyl]-propyl}-phosphinic acid | CHEMBL327108
TypeSmall organic molecule
Emp. Form.C37H38BrN4O6PS
Mol. Mass.777.664
SMILESNC(=O)C(Cc1c[nH]c2ccccc12)NC(=O)C(CSc1ccccc1Br)CP(O)(=O)C(Cc1ccccc1)NC(=O)OCc1ccccc1