Reaction Details
TargetNeutrophil collagenase
LigandBDBM50138684
Substrate/Competitorn/a
Meas. Tech.ChEMBL_105074 (CHEMBL711319)
Ki 2.5±n/a nM
Citation Matziari, MBeau, FCuniasse, PDive, VYiotakis, A Evaluation of P1'-diversified phosphinic peptides leads to the development of highly selective inhibitors of MMP-11. J Med Chem47:325-36 (2004) 
 
Neutrophil collagenase
Name:Neutrophil collagenase
Type:Enzyme
Mol. Mass.:53413.48
Organism:Homo sapiens (Human)
Description:P22894
Residue:467
BDBM50138684
NameBDBM50138684
Synonyms:(1-Benzyloxycarbonylamino-2-phenyl-ethyl)-{2-[1-carbamoyl-2-(1H-indol-3-yl)-ethylcarbamoyl]-5-phenyl-pentyl}-phosphinic acid CHEMBL115774
TypeSmall organic molecule
Emp. Form.C39H43N4O6P
Mol. Mass.694.7557
SMILESNC(=O)C(Cc1c[nH]c2ccccc12)NC(=O)C(CCCc1ccccc1)CP(O)(=O)C(Cc1ccccc1)NC(=O)OCc1ccccc1