Reaction Details
Target72 kDa type IV collagenase
LigandBDBM50138685
Substrate/Competitorn/a
Meas. Tech.ChEMBL_104396 (CHEMBL714999)
Ki 30000±n/a nM
Citation Matziari, MBeau, FCuniasse, PDive, VYiotakis, A Evaluation of P1'-diversified phosphinic peptides leads to the development of highly selective inhibitors of MMP-11. J Med Chem47:325-36 (2004) 
 
72 kDa type IV collagenase
Name:72 kDa type IV collagenase
Type:Enzyme
Mol. Mass.:73870.36
Organism:Homo sapiens (Human)
Description: P08253
Residue:660
BDBM50138685
NameBDBM50138685
Synonyms:(1-Benzyloxycarbonylamino-2-phenyl-ethyl)-[2-[1-carbamoyl-2-(1H-indol-3-yl)-ethylcarbamoyl]-3-(2-methoxy-phenylsulfanyl)-propyl]-phosphinic acid | CHEMBL324891
TypeSmall organic molecule
Emp. Form.C38H41N4O7PS
Mol. Mass.728.794
SMILESCOc1ccccc1SCC(CP(O)(=O)C(Cc1ccccc1)NC(=O)OCc1ccccc1)C(=O)NC(Cc1c[nH]c2ccccc12)C(N)=O