Reaction Details
TargetRenin
LigandBDBM50139110
Substrate/Competitorn/a
Meas. Tech.ChEBML_196262
Ki 24400±n/a nM
Citation Brady, SFSingh, SCrouthamel, MCHolloway, MKCoburn, CAGarsky, VMBogusky, MPennington, MWVacca, JPHazuda, DLai, MT Rational design and synthesis of selective BACE-1 inhibitors. Bioorg Med Chem Lett14:601-4 (2004) Renin
Name:Renin
Type:Enzyme
Mol. Mass.:45058.99
Organism:Homo sapiens (Human)
Description:n/a
Residue:406
BDBM50139110
NameBDBM50139110
Synonyms:(S)-N-((1S,2S,4R)-1-Benzyl-2-hydroxy-4-isobutylcarbamoyl-heptyl)-2-(3-methyl-butyrylamino)-succinamic acid | CHEMBL158203
TypeSmall organic molecule
Emp. Form.C28H45N3O6
Mol. Mass.519.6734
SMILESCCC[C@H](C[C@H](O)[C@H](Cc1ccccc1)NC(=O)C[C@H](NC(=O)CC(C)C)C(O)=O)C(=O)NCC(C)C