Reaction Details
TargetGeranylgeranyl transferase type-1 subunit beta/Protein farnesyltransferase/geranylgeranyltransferase type-1 subunit alpha
LigandBDBM50139188
Substrate/Competitorn/a
Meas. Tech.ChEMBL_71972 (CHEMBL684165)
IC50 2.1±n/a nM
Citation Dinsmore, CJZartman, CBBergman, JMAbrams, MTBuser, CACulberson, JCDavide, JPEllis-Hutchings, MFernandes, CGraham, SLHartman, GDHuber, HELobell, RBMosser, SDRobinson, RGWilliams, TM Macrocyclic piperazinones as potent dual inhibitors of farnesyltransferase and geranylgeranyltransferase-I. Bioorg Med Chem Lett14:639-43 (2004) Geranylgeranyl transferase type-1 subunit beta/Protein farnesyltransferase/geranylgeranyltransferase type-1 subunit alpha
Name:Geranylgeranyl transferase type-1 subunit beta/Protein farnesyltransferase/geranylgeranyltransferase type-1 subunit alpha
Type:n/a
Mol. Mass.:n/a
Description:ASSAY_ID of EBI is 70196
Components:This complex has 2 components.
Component 1
Name:Protein farnesyltransferase/geranylgeranyltransferase type-1 subunit alpha
Synonyms:CAAX farnesyltransferase alpha subunit FNTA_HUMAN FTase-alpha Geranylgeranyl Transferase (GGTase-I) Chain A Protein Farnesyltransferase (PFT) Chain A Protein farnesyltransferase Protein farnesyltransferase/geranylgeranyltransferase type I alpha subunit | Ras proteins prenyltransferase alpha
Type:Enzyme
Mol. Mass.:44392.46
Organism:Homo sapiens (Human)
Description:Recombinant human FTase.
Residue:379
Component 2
Name:Geranylgeranyl transferase type-1 subunit beta
Synonyms:2.5.1.59 Geranylgeranyl transferase type I Geranylgeranyl transferase type I subunit beta PGGT1B Protein farnesyl/geranylgeranyl transferase | Type I protein geranyl-geranyltransferase subunit beta
Type:n/a
Mol. Mass.:42369.84
Organism:Homo sapiens (Human)
Description:n/a
Residue:377
BDBM50139188
NameBDBM50139188
Synonyms:4-(3,3-dimethylbutyl)-23-oxo-8-oxa-1,15,17,21-tetraazapentacyclo[19.2.2.13,7.19,13.015,19]heptacosa-3(27),4,6,9(26),10,12,16,18-octaen-10-yl cyanide | CHEMBL157295
TypeSmall organic molecule
Emp. Form.C29H33N5O2
Mol. Mass.483.6046
SMILESCC(C)(C)CCc1ccc2Oc3cc(Cn4cncc4CN4CCN(Cc1c2)C(=O)C4)ccc3C#N