Reaction Details
TargetProteasome subunit beta type-9
LigandBDBM50538188
Substrate/Competitorn/a
Meas. Tech.ChEMBL_2120229 (CHEMBL4829376)
IC50 71±n/a nM
Citation Lee, MJBhattarai, DJang, HBaek, AYeo, IJLee, SMiller, ZLee, SHong, JTKim, DELee, WKim, KB Macrocyclic Immunoproteasome Inhibitors as a Potential Therapy for Alzheimer's Disease. J Med Chem64:10934-10950 (2021) 
 
Proteasome subunit beta type-9
Name:Proteasome subunit beta type-9
Type:PROTEIN
Mol. Mass.:23256.49
Organism:Homo sapiens (Human)
Description:ChEMBL_106197
Residue:219
BDBM50538188
NameBDBM50538188
Synonyms:CHEMBL4649310
TypeSmall organic molecule
Emp. Form.C30H38N6O6
Mol. Mass.578.6593
SMILESCC(C)C[C@H](NC(=O)[C@H](Cc1ccccc1)NC(=O)[C@@H]1CCCN1C(=O)CNC(=O)c1cnccn1)C(=O)[C@@]1(C)CO1