Reaction Details
TargetProteasome subunit beta type-9
LigandBDBM50573703
Substrate/Competitorn/a
Meas. Tech.ChEMBL_2120229 (CHEMBL4829376)
IC50 66±n/a nM
Citation Lee, MJBhattarai, DJang, HBaek, AYeo, IJLee, SMiller, ZLee, SHong, JTKim, DELee, WKim, KB Macrocyclic Immunoproteasome Inhibitors as a Potential Therapy for Alzheimer's Disease. J Med Chem64:10934-10950 (2021) 
 
Proteasome subunit beta type-9
Name:Proteasome subunit beta type-9
Type:PROTEIN
Mol. Mass.:23256.49
Organism:Homo sapiens (Human)
Description:ChEMBL_106197
Residue:219
BDBM50573703
NameBDBM50573703
Synonyms:CHEMBL4870740
TypeSmall organic molecule
Emp. Form.C26H42N4O7
Mol. Mass.522.6343
SMILES[H][C@@]12CCCN1C(=O)CNC(=O)CCCCCCOC[C@H](NC2=O)C(=O)N[C@@H](CC(C)C)C(=O)[C@@]1(C)CO1