Reaction Details
TargetProteasome subunit beta type-9
LigandBDBM50538161
Substrate/Competitorn/a
Meas. Tech.ChEMBL_2120236 (CHEMBL4829383)
IC50 31±n/a nM
Citation Lee, MJBhattarai, DJang, HBaek, AYeo, IJLee, SMiller, ZLee, SHong, JTKim, DELee, WKim, KB Macrocyclic Immunoproteasome Inhibitors as a Potential Therapy for Alzheimer's Disease. J Med Chem64:10934-10950 (2021) 
 
Proteasome subunit beta type-9
Name:Proteasome subunit beta type-9
Type:PROTEIN
Mol. Mass.:23256.49
Organism:Homo sapiens (Human)
Description:ChEMBL_106197
Residue:219
BDBM50538161
NameBDBM50538161
Synonyms:CHEMBL4646371
TypeSmall organic molecule
Emp. Form.C27H38N4O6
Mol. Mass.514.6138
SMILESCC(C)C[C@H](NC(=O)[C@H](Cc1ccccc1)NC(=O)[C@@H]1CCCN1C(=O)CNC(C)=O)C(=O)[C@@]1(C)CO1