Reaction Details
TargetCorticotropin-releasing factor receptor 1
LigandBDBM50139901
Substrate/Competitorn/a
Meas. Tech.ChEMBL_51110 (CHEMBL666548)
Ki 45.1±n/a nM
Citation Yamada, YMizutani, KMizusawa, YHantani, YTanaka, MTanaka, YTomimoto, MSugawara, MImai, NYamada, HOkajima, NHaruta, J New class of corticotropin-releasing factor (CRF) antagonists: small peptides having high binding affinity for CRF receptor. J Med Chem47:1075-8 (2004) 
 
Corticotropin-releasing factor receptor 1
Name:Corticotropin-releasing factor receptor 1
Type:Enzyme
Mol. Mass.:50744.31
Organism:Homo sapiens (Human)
Description:P34998
Residue:444
BDBM50139901
NameBDBM50139901
Synonyms:Ac-(Glu-Ala-His-Lys)-Leu-Lys-Lys-Leu-Nle-Glu-Ile-Ile-NH2 | CHEMBL438456
TypeSmall organic molecule
Emp. Form.C70H120N18O17
Mol. Mass.1485.8122
SMILESCC[C@H](C)[C@H](NC(=O)[C@@H](NC(=O)[C@H](CCC(O)=O)NC(=O)C(CCCCC(=O)[C@H](CC(C)C)NC(=O)[C@H](CCCCN)NC(=O)[C@@H](CCCCN)NC(=O)[C@H](CC(N)=O)NC(=O)[C@@H]1CCCCNC(=O)CC[C@@H](NC(C)=O)C(=O)N[C@@H](C)C(=O)N[C@@H](Cc2cnc[nH]2)C(=O)N1)C(C)C)[C@@H](C)CC)C(N)=O