Reaction Details
TargetCorticotropin-releasing factor receptor 1
LigandBDBM50139915
Substrate/Competitorn/a
Meas. Tech.ChEMBL_51110 (CHEMBL666548)
Ki 36.7±n/a nM
Citation Yamada, YMizutani, KMizusawa, YHantani, YTanaka, MTanaka, YTomimoto, MSugawara, MImai, NYamada, HOkajima, NHaruta, J New class of corticotropin-releasing factor (CRF) antagonists: small peptides having high binding affinity for CRF receptor. J Med Chem47:1075-8 (2004) 
 
Corticotropin-releasing factor receptor 1
Name:Corticotropin-releasing factor receptor 1
Type:Enzyme
Mol. Mass.:50744.31
Organism:Homo sapiens (Human)
Description:P34998
Residue:444
BDBM50139915
NameBDBM50139915
Synonyms:Ac-(Glu-Ala-Glu-Lys)-Leu-Arg-Lys-Leu-Nle-Asp-Ile-Ile-NH2 | CHEMBL384468
TypeSmall organic molecule
Emp. Form.C68H118N18O19
Mol. Mass.1491.7737
SMILESCC[C@H](C)[C@H](NC(=O)[C@@H](NC(=O)[C@H](CC(O)=O)NC(=O)C(CCCCC(=O)[C@H](CC(C)C)NC(=O)[C@H](CCCCN)NC(=O)[C@H](CCCNC(N)=N)NC(=O)[C@H](CC(N)=O)NC(=O)[C@@H]1CCCCNC(=O)CC[C@@H](NC(C)=O)C(=O)N[C@@H](C)C(=O)N[C@@H](CCC(O)=O)C(=O)N1)C(C)C)[C@@H](C)CC)C(N)=O