Reaction Details
TargetHistone deacetylase 2b
LigandBDBM50134805
Substrate/Competitorn/a
Meas. Tech.ChEMBL_87549 (CHEMBL695147)
IC50 10±n/a nM
Citation Mai, AMassa, SCerbara, IValente, SRagno, RBottoni, PScatena, RLoidl, PBrosch, G 3-(4-Aroyl-1-methyl-1H-2-pyrrolyl)-N-hydroxy-2-propenamides as a new class of synthetic histone deacetylase inhibitors. 2. Effect of pyrrole-C2 and/or -C4 substitutions on biological activity. J Med Chem47:1098-109 (2004) 
 
Histone deacetylase 2b
Name:Histone deacetylase 2b
Synonyms:Histone deacetylase HD2
Type:PROTEIN
Mol. Mass.:30785.07
Organism:Zea mays
Description:ChEMBL_87549
Residue:286
BDBM50134805
NameBDBM50134805
TypeSmall organic molecule
Emp. Form.C34H42N4O6
Mol. Mass.602.7205
SMILESO=C(CCCCC[C@@H]1NC(=O)[C@H]2CCCCN2C(=O)[C@H](Cc2ccccc2)NC(=O)[C@H](Cc2ccccc2)NC1=O)C1CO1