Reaction Details
TargetPannexin-1
LigandBDBM50574562
Substrate/Competitorn/a
Meas. Tech.ChEMBL_2122674 (CHEMBL4831907)
IC50 27500±n/a nM
Citation Crocetti, LGuerrini, GPuglioli, SGiovannoni, MPDi Cesare Mannelli, LLucarini, EGhelardini, CWang, JDahl, G Design and synthesis of the first indole-based blockers of Panx-1 channel. Eur J Med Chem223:0 (2021) 
 
Pannexin-1
Name:Pannexin-1
Type:PROTEIN
Mol. Mass.:48168.73
Organism:Mus musculus
Description:ChEMBL_120484
Residue:426
BDBM50574562
NameBDBM50574562
Synonyms:CHEMBL4873114
TypeSmall organic molecule
Emp. Form.C16H12N2O4
Mol. Mass.296.2775
SMILESOC(=O)c1cn(Cc2ccccc2)c2ccc(cc12)[N+]([O-])=O