Reaction Details
TargetPannexin-1
LigandBDBM50574563
Substrate/Competitorn/a
Meas. Tech.ChEMBL_2122674 (CHEMBL4831907)
IC50 12400±n/a nM
Citation Crocetti, LGuerrini, GPuglioli, SGiovannoni, MPDi Cesare Mannelli, LLucarini, EGhelardini, CWang, JDahl, G Design and synthesis of the first indole-based blockers of Panx-1 channel. Eur J Med Chem223:0 (2021) 
 
Pannexin-1
Name:Pannexin-1
Type:PROTEIN
Mol. Mass.:48168.73
Organism:Mus musculus
Description:ChEMBL_120484
Residue:426
BDBM50574563
NameBDBM50574563
Synonyms:CHEMBL4862099
TypeSmall organic molecule
Emp. Form.C18H16N2O4
Mol. Mass.324.3306
SMILESOC(=O)c1cn(CCCc2ccccc2)c2ccc(cc12)[N+]([O-])=O