Reaction Details
TargetPannexin-1
LigandBDBM50574566
Substrate/Competitorn/a
Meas. Tech.ChEMBL_2122674 (CHEMBL4831907)
IC50 250±n/a nM
Citation Crocetti, LGuerrini, GPuglioli, SGiovannoni, MPDi Cesare Mannelli, LLucarini, EGhelardini, CWang, JDahl, G Design and synthesis of the first indole-based blockers of Panx-1 channel. Eur J Med Chem223:0 (2021) 
 
Pannexin-1
Name:Pannexin-1
Type:PROTEIN
Mol. Mass.:48168.73
Organism:Mus musculus
Description:ChEMBL_120484
Residue:426
BDBM50574566
NameBDBM50574566
Synonyms:CHEMBL4855581
TypeSmall organic molecule
Emp. Form.C31H26N2O6S
Mol. Mass.554.613
SMILESOC(=O)c1cc2cc(ccc2n1Cc1ccc(cc1)C(O)=O)S(=O)(=O)N(Cc1ccccc1)Cc1ccccc1