Reaction Details
TargetPannexin-1
LigandBDBM50574567
Substrate/Competitorn/a
Meas. Tech.ChEMBL_2122674 (CHEMBL4831907)
IC50 800±n/a nM
Citation Crocetti, LGuerrini, GPuglioli, SGiovannoni, MPDi Cesare Mannelli, LLucarini, EGhelardini, CWang, JDahl, G Design and synthesis of the first indole-based blockers of Panx-1 channel. Eur J Med Chem223:0 (2021) 
 
Pannexin-1
Name:Pannexin-1
Type:PROTEIN
Mol. Mass.:48168.73
Organism:Mus musculus
Description:ChEMBL_120484
Residue:426
BDBM50574567
NameBDBM50574567
Synonyms:CHEMBL4847247
TypeSmall organic molecule
Emp. Form.C25H20N2O8S
Mol. Mass.508.5
SMILESOC(=O)c1cc2cc(ccc2n1Cc1ccc(cc1)C(O)=O)S(=O)(=O)NCc1ccc(cc1)C(O)=O